Target
Regulator of G-protein signaling 7
Ligand
BDBM45025
Substrate
Meas. Tech.
Dose response, multiplexed high-throughput screen for small molecule regulators of RGS family protein interactions, specifically RGS7-Galphao.
EC50
>30000±n/a nM
Citation
 PubChem, PC Dose response, multiplexed high-throughput screen for small molecule regulators of RGS family protein interactions, specifically RGS7-Galphao. PubChem Bioassay (2009)[AID] 
Target
Name:
Regulator of G-protein signaling 7
Synonyms:
RGS7 | RGS7_HUMAN
Type:
Enzyme Catalytic Domain
Mol. Mass.:
57675.72
Organism:
Homo sapiens (Human)
Description:
P49802
Residue:
495
  
Inhibitor
Name:
BDBM45025
Synonyms:
1,6,6-triphenyl-3-(p-tolyl)-3-azabicyclo[3.1.0]hexane-2,4-quinone MLS000577352 cid_2929373
Type:
Small organic molecule
Emp. Form.:
C30H23NO2
Mol. Mass.:
429.5091
SMILES:
Cc1ccc(cc1)N1C(=O)C2C(C1=O)(c1ccccc1)C2(c1ccccc1)c1ccccc1
: