Target
Regulator of G-protein signaling 7
Ligand
BDBM47421
Substrate
Meas. Tech.
Dose response, multiplexed high-throughput screen for small molecule regulators of RGS family protein interactions, specifically RGS7-Galphao.
EC50
>30000±n/a nM
Citation
 PubChem, PC Dose response, multiplexed high-throughput screen for small molecule regulators of RGS family protein interactions, specifically RGS7-Galphao. PubChem Bioassay (2009)[AID] 
Target
Name:
Regulator of G-protein signaling 7
Synonyms:
RGS7 | RGS7_HUMAN
Type:
Enzyme Catalytic Domain
Mol. Mass.:
57675.72
Organism:
Homo sapiens (Human)
Description:
P49802
Residue:
495
  
Inhibitor
Name:
BDBM47421
Synonyms:
MLS000374912 N-(1-adamantylcarbamoyl)-2-chloro-acetamide N-[(1-adamantylamino)-oxomethyl]-2-chloroacetamide cid_2378425
Type:
Small organic molecule
Emp. Form.:
C13H19ClN2O2
Mol. Mass.:
270.755
SMILES:
[H]C12CC3([H])CC([H])(C1)CC(C2)(C3)NC(=O)NC(=O)CCl
: