Target
Regulator of G-protein signaling 7
Ligand
BDBM47791
Substrate
Meas. Tech.
Dose response, multiplexed high-throughput screen for small molecule regulators of RGS family protein interactions, specifically RGS7-Galphao.
EC50
4800±n/a nM
Citation
 PubChem, PC Dose response, multiplexed high-throughput screen for small molecule regulators of RGS family protein interactions, specifically RGS7-Galphao. PubChem Bioassay (2009)[AID] 
Target
Name:
Regulator of G-protein signaling 7
Synonyms:
RGS7 | RGS7_HUMAN
Type:
Enzyme Catalytic Domain
Mol. Mass.:
57675.72
Organism:
Homo sapiens (Human)
Description:
P49802
Residue:
495
  
Inhibitor
Name:
BDBM47791
Synonyms:
2-(3-keto-4,6-dimethyl-isothiazolo[5,4-b]pyridin-2-yl)-N-propyl-acetamide 2-(4,6-dimethyl-3-oxo-2-isothiazolo[5,4-b]pyridinyl)-N-propylacetamide 2-(4,6-dimethyl-3-oxoisothiazolo[5,4-b]pyridin-2(3H)-yl)-N-propylacetamide SMR000309789 | cid_6619971
Type:
Small organic molecule
Emp. Form.:
C13H17N3O2S
Mol. Mass.:
279.358
SMILES:
CCCNC(=O)Cn1sc2nc(C)cc(C)c2c1=O
: