Target
Regulator of G-protein signaling 19
Ligand
BDBM34435
Substrate
Meas. Tech.
Dose response, multiplexed high-throughput screen for small molecule regulators of RGS family protein interactions, specifically RGS19-Galphao.
EC50
1420±n/a nM
Citation
 PubChem, PC Dose response, multiplexed high-throughput screen for small molecule regulators of RGS family protein interactions, specifically RGS19-Galphao. PubChem Bioassay (2009)[AID] 
Target
Name:
Regulator of G-protein signaling 19
Synonyms:
G protein signalling regulator 19 GNAI3IP RGS19_HUMAN | Regulator of G-protein signaling 19 (RGS19)
Type:
Enzyme Catalytic Domain
Mol. Mass.:
24631.38
Organism:
Homo sapiens (Human)
Description:
gi_86990435
Residue:
217
  
Inhibitor
Name:
BDBM34435
Synonyms:
4-cyano-3-methyl-5-[[1-oxo-2-[[5-(phenylmethyl)-1,3,4-oxadiazol-2-yl]thio]ethyl]amino]-2-thiophenecarboxylic acid ethyl ester MLS000051364 cid_2222655 ethyl 5-({[(5-benzyl-1,3,4-oxadiazol-2-yl)thio]acetyl}amino)-4-cyano-3-methyl-2-thiophenecarboxylate | ethyl 5-[[2-[(5-benzyl-1,3,4-oxadiazol-2-yl)sulfanyl]acetyl]amino]-4-cyano-3-methylthiophene-2-carboxylate
Type:
Small organic molecule
Emp. Form.:
C20H18N4O4S2
Mol. Mass.:
442.511
SMILES:
CCOC(=O)c1sc(NC(=O)CSc2nnc(Cc3ccccc3)o2)c(C#N)c1C
: