Target
Regulator of G-protein signaling 19
Ligand
BDBM41057
Substrate
Meas. Tech.
Dose response, multiplexed high-throughput screen for small molecule regulators of RGS family protein interactions, specifically RGS19-Galphao.
EC50
>30000±n/a nM
Citation
 PubChem, PC Dose response, multiplexed high-throughput screen for small molecule regulators of RGS family protein interactions, specifically RGS19-Galphao. PubChem Bioassay (2009)[AID] 
Target
Name:
Regulator of G-protein signaling 19
Synonyms:
G protein signalling regulator 19 GNAI3IP RGS19_HUMAN | Regulator of G-protein signaling 19 (RGS19)
Type:
Enzyme Catalytic Domain
Mol. Mass.:
24631.38
Organism:
Homo sapiens (Human)
Description:
gi_86990435
Residue:
217
  
Inhibitor
Name:
BDBM41057
Synonyms:
MLS000544577 N-[[2-(1-azepanyl)-5-nitrophenyl]methylideneamino]-2-(9-oxo-10-acridinyl)acetamide N-[[2-(azepan-1-yl)-5-nitro-phenyl]methylideneamino]-2-(9-oxidanylideneacridin-10-yl)ethanamide SMR000163144 | cid_2883648
Type:
Small organic molecule
Emp. Form.:
C28H27N5O4
Mol. Mass.:
497.5451
SMILES:
[O-][N+](=O)c1ccc(N2CCCCCC2)c([CH+][N-]NC(=O)Cn2c3ccccc3c(=O)c3ccccc23)c1
: