Target
Regulator of G-protein signaling 19
Ligand
BDBM47754
Substrate
Meas. Tech.
Dose response, multiplexed high-throughput screen for small molecule regulators of RGS family protein interactions, specifically RGS19-Galphao.
EC50
>30000±n/a nM
Citation
 PubChem, PC Dose response, multiplexed high-throughput screen for small molecule regulators of RGS family protein interactions, specifically RGS19-Galphao. PubChem Bioassay (2009)[AID] 
Target
Name:
Regulator of G-protein signaling 19
Synonyms:
G protein signalling regulator 19 GNAI3IP RGS19_HUMAN | Regulator of G-protein signaling 19 (RGS19)
Type:
Enzyme Catalytic Domain
Mol. Mass.:
24631.38
Organism:
Homo sapiens (Human)
Description:
gi_86990435
Residue:
217
  
Inhibitor
Name:
BDBM47754
Synonyms:
2,6-dimethyl-4-(3-nitrophenyl)-1,4-dihydropyridine-3,5-dicarboxylic acid O3-ethyl ester O5-(2-nicotinamidoethyl) ester 3-O-ethyl 5-O-[2-(pyridine-3-carbonylamino)ethyl] 2,6-dimethyl-4-(3-nitrophenyl)-1,4-dihydropyridine-3,5-dicarboxylate MLS000705931 SMR000230184 | cid_3655532
Type:
Small organic molecule
Emp. Form.:
C25H26N4O7
Mol. Mass.:
494.4965
SMILES:
CCOC(=O)C1C(C(C(=O)OCCNC(=O)c2cccnc2)=C(C)N=C1C)c1cccc(c1)[N+]([O-])=O
: