Target
Regulator of G-protein signaling 19
Ligand
BDBM47763
Substrate
Meas. Tech.
Dose response, multiplexed high-throughput screen for small molecule regulators of RGS family protein interactions, specifically RGS19-Galphao.
EC50
>30000±n/a nM
Citation
 PubChem, PC Dose response, multiplexed high-throughput screen for small molecule regulators of RGS family protein interactions, specifically RGS19-Galphao. PubChem Bioassay (2009)[AID] 
Target
Name:
Regulator of G-protein signaling 19
Synonyms:
G protein signalling regulator 19 GNAI3IP RGS19_HUMAN | Regulator of G-protein signaling 19 (RGS19)
Type:
Enzyme Catalytic Domain
Mol. Mass.:
24631.38
Organism:
Homo sapiens (Human)
Description:
gi_86990435
Residue:
217
  
Inhibitor
Name:
BDBM47763
Synonyms:
1-(4-chloranyl-2,5-dimethoxy-phenyl)sulfonyl-2-ethyl-imidazole 1-(4-chloro-2,5-dimethoxyphenyl)sulfonyl-2-ethylimidazole MLS000705517 cid_850092
Type:
Small organic molecule
Emp. Form.:
C13H15ClN2O4S
Mol. Mass.:
330.787
SMILES:
CCc1nccn1S(=O)(=O)c1cc(OC)c(Cl)cc1OC
: