Target
Regulator of G-protein signaling 19
Ligand
BDBM47774
Substrate
Meas. Tech.
Dose response, multiplexed high-throughput screen for small molecule regulators of RGS family protein interactions, specifically RGS19-Galphao.
EC50
>30000±n/a nM
Citation
 PubChem, PC Dose response, multiplexed high-throughput screen for small molecule regulators of RGS family protein interactions, specifically RGS19-Galphao. PubChem Bioassay (2009)[AID] 
Target
Name:
Regulator of G-protein signaling 19
Synonyms:
G protein signalling regulator 19 GNAI3IP RGS19_HUMAN | Regulator of G-protein signaling 19 (RGS19)
Type:
Enzyme Catalytic Domain
Mol. Mass.:
24631.38
Organism:
Homo sapiens (Human)
Description:
gi_86990435
Residue:
217
  
Inhibitor
Name:
BDBM47774
Synonyms:
MLS000621789 N-(3-chloro-4-methyl-phenyl)-2-[[4-keto-3-(3-piperidinopropyl)quinazolin-2-yl]thio]acetamide N-(3-chloro-4-methylphenyl)-2-[[4-oxo-3-[3-(1-piperidinyl)propyl]-2-quinazolinyl]thio]acetamide SMR000310716 | cid_4132205
Type:
Small organic molecule
Emp. Form.:
C25H29ClN4O2S
Mol. Mass.:
485.041
SMILES:
Cc1ccc(NC(=O)CSc2nc3ccccc3c(=O)n2CCCN2CCCCC2)cc1Cl
: