Target
Regulator of G-protein signaling 19
Ligand
BDBM47777
Substrate
Meas. Tech.
Dose response, multiplexed high-throughput screen for small molecule regulators of RGS family protein interactions, specifically RGS19-Galphao.
EC50
>30000±n/a nM
Citation
 PubChem, PC Dose response, multiplexed high-throughput screen for small molecule regulators of RGS family protein interactions, specifically RGS19-Galphao. PubChem Bioassay (2009)[AID] 
Target
Name:
Regulator of G-protein signaling 19
Synonyms:
G protein signalling regulator 19 GNAI3IP RGS19_HUMAN | Regulator of G-protein signaling 19 (RGS19)
Type:
Enzyme Catalytic Domain
Mol. Mass.:
24631.38
Organism:
Homo sapiens (Human)
Description:
gi_86990435
Residue:
217
  
Inhibitor
Name:
BDBM47777
Synonyms:
MLS000375249 N-[1-[1-[2-[4-(diethylamino)anilino]-2-oxoethyl]-2-benzimidazolyl]ethyl]-4-methylbenzamide N-[1-[1-[2-[[4-(diethylamino)phenyl]amino]-2-oxidanylidene-ethyl]benzimidazol-2-yl]ethyl]-4-methyl-benzamide cid_4831653
Type:
Small organic molecule
Emp. Form.:
C29H33N5O2
Mol. Mass.:
483.6046
SMILES:
CCN(CC)c1ccc(NC(=O)Cn2c(nc3ccccc23)C(C)NC(=O)c2ccc(C)cc2)cc1
: