Target
Regulator of G-protein signaling 19
Ligand
BDBM47831
Substrate
Meas. Tech.
Dose response, multiplexed high-throughput screen for small molecule regulators of RGS family protein interactions, specifically RGS19-Galphao.
EC50
>30000±n/a nM
Citation
 PubChem, PC Dose response, multiplexed high-throughput screen for small molecule regulators of RGS family protein interactions, specifically RGS19-Galphao. PubChem Bioassay (2009)[AID] 
Target
Name:
Regulator of G-protein signaling 19
Synonyms:
G protein signalling regulator 19 GNAI3IP RGS19_HUMAN | Regulator of G-protein signaling 19 (RGS19)
Type:
Enzyme Catalytic Domain
Mol. Mass.:
24631.38
Organism:
Homo sapiens (Human)
Description:
gi_86990435
Residue:
217
  
Inhibitor
Name:
BDBM47831
Synonyms:
MLS001111288 N-[4-(4-fluorophenyl)-2-methyl-5-(trifluoromethyl)-3-pyrazolyl]-2-furancarboxamide N-[4-(4-fluorophenyl)-2-methyl-5-(trifluoromethyl)pyrazol-3-yl]furan-2-carboxamide cid_2809607
Type:
Small organic molecule
Emp. Form.:
C16H11F4N3O2
Mol. Mass.:
353.2711
SMILES:
Cn1nc(c(c1NC(=O)c1ccco1)-c1ccc(F)cc1)C(F)(F)F
: