Target
Regulator of G-protein signaling 16
Ligand
BDBM47730
Substrate
Meas. Tech.
Dose respone, multiplexed high-throughput screen for small molecule regulators of RGS family protein interactions, specifically RGS16-Galphao.
EC50
>30000±n/a nM
Citation
 PubChem, PC Dose respone, multiplexed high-throughput screen for small molecule regulators of RGS family protein interactions, specifically RGS16-Galphao. PubChem Bioassay (2009)[AID] 
Target
Name:
Regulator of G-protein signaling 16
Synonyms:
RGS16 RGSR regulator of G-protein signalling 16
Type:
Enzyme Catalytic Domain
Mol. Mass.:
22748.87
Organism:
Homo sapiens (Human)
Description:
gi_156416009
Residue:
202
  
Inhibitor
Name:
BDBM47730
Synonyms:
2-(2-propan-2-ylsulfanyl-1,3-benzothiazol-6-yl)-3a,4,5,6,7,7a-hexahydroisoindole-1,3-dione 2-[2-(isopropylthio)-1,3-benzothiazol-6-yl]hexahydro-1H-isoindole-1,3(2H)-dione MLS000571852 cid_2881020
Type:
Small organic molecule
Emp. Form.:
C18H20N2O2S2
Mol. Mass.:
360.494
SMILES:
CC(C)Sc1nc2ccc(cc2s1)-n1c(O)c2CCCCc2c1O
: