Target
Regulator of G-protein signaling 16
Ligand
BDBM47802
Substrate
Meas. Tech.
Dose respone, multiplexed high-throughput screen for small molecule regulators of RGS family protein interactions, specifically RGS16-Galphao.
EC50
>30000±n/a nM
Citation
 PubChem, PC Dose respone, multiplexed high-throughput screen for small molecule regulators of RGS family protein interactions, specifically RGS16-Galphao. PubChem Bioassay (2009)[AID] 
Target
Name:
Regulator of G-protein signaling 16
Synonyms:
RGS16 RGSR regulator of G-protein signalling 16
Type:
Enzyme Catalytic Domain
Mol. Mass.:
22748.87
Organism:
Homo sapiens (Human)
Description:
gi_156416009
Residue:
202
  
Inhibitor
Name:
BDBM47802
Synonyms:
2-thiophenecarboxylic acid [4-[4-(dimethoxymethyl)-2-pyrimidinyl]phenyl] ester MLS000721168 [4-[4-(dimethoxymethyl)pyrimidin-2-yl]phenyl] thiophene-2-carboxylate thiophene-2-carboxylic acid [4-[4-(dimethoxymethyl)pyrimidin-2-yl]phenyl] ester
Type:
Small organic molecule
Emp. Form.:
C18H16N2O4S
Mol. Mass.:
356.396
SMILES:
COC(OC)c1ccnc(n1)-c1ccc(OC(=O)c2cccs2)cc1
: