Target
Heat shock protein HSP 90-alpha
Ligand
BDBM47939
Substrate
Meas. Tech.
Luminescence-based dose response biochemical high throughput screening assay for inhibitors of the Heat Shock Protein 90 (HSP90)
IC50
9385±n/a nM
Citation
 PubChem, PC Luminescence-based dose response biochemical high throughput screening assay for inhibitors of the Heat Shock Protein 90 (HSP90) PubChem Bioassay (2009)[AID] 
Target
Name:
Heat shock protein HSP 90-alpha
Synonyms:
HS90A_HUMAN HSP86 HSP90AA1 HSPCA Heat shock 86 kDa Heat shock protein HSP 90-alpha (HSP90) LAP-2 Lipopolysaccharide-associated protein 2 heat shock protein 90kDa alpha (cytosolic), class A member 1 isoform 2
Type:
Molecular Chaperone
Mol. Mass.:
84623.45
Organism:
Homo sapiens (Human)
Description:
P07900
Residue:
732
  
Inhibitor
Name:
BDBM47939
Synonyms:
1-(5-Benzo[1,3]dioxol-5-yl-[1,3,4]oxadiazol-2-ylsulfanyl)-propan-2-one 1-[[5-(1,3-benzodioxol-5-yl)-1,3,4-oxadiazol-2-yl]thio]-2-propanone MLS000121993 cid_1084440
Type:
Small organic molecule
Emp. Form.:
C12H10N2O4S
Mol. Mass.:
278.284
SMILES:
CC(=O)CSc1nnc(o1)-c1ccc2OCOc2c1
: