Target
Heat shock protein HSP 90-alpha
Ligand
BDBM47991
Substrate
Meas. Tech.
Luminescence-based dose response biochemical high throughput screening assay for inhibitors of the Heat Shock Protein 90 (HSP90)
IC50
2200±n/a nM
Citation
 PubChem, PC Luminescence-based dose response biochemical high throughput screening assay for inhibitors of the Heat Shock Protein 90 (HSP90) PubChem Bioassay (2009)[AID] 
Target
Name:
Heat shock protein HSP 90-alpha
Synonyms:
HS90A_HUMAN HSP86 HSP90AA1 HSPCA Heat shock 86 kDa Heat shock protein HSP 90-alpha (HSP90) LAP-2 Lipopolysaccharide-associated protein 2 heat shock protein 90kDa alpha (cytosolic), class A member 1 isoform 2
Type:
Molecular Chaperone
Mol. Mass.:
84623.45
Organism:
Homo sapiens (Human)
Description:
P07900
Residue:
732
  
Inhibitor
Name:
BDBM47991
Synonyms:
(3Z)-6-chloranyl-3-(2-oxidanylidene-2-thiophen-2-yl-ethylidene)-4H-1,4-benzoxazin-2-one (3Z)-6-chloro-3-[2-keto-2-(2-thienyl)ethylidene]-4H-1,4-benzoxazin-2-one MLS000769456 cid_5614757
Type:
Small organic molecule
Emp. Form.:
C14H8ClNO3S
Mol. Mass.:
305.736
SMILES:
Clc1ccc2oc(=O)c(CC(=O)c3cccs3)nc2c1
: