Target
Muscarinic acetylcholine receptor M4
Ligand
BDBM48062
Substrate
Meas. Tech.
Discovery of a Highly Selective in vitro and in vivo M4 Positive Allosteric Modulator(PAM): Analog Potency
EC50
10000±n/a nM
Citation
 PubChem, PC Discovery of a Highly Selective in vitro and in vivo M4 Positive Allosteric Modulator(PAM): Analog Potency PubChem Bioassay (2010)[AID] 
Target
Name:
Muscarinic acetylcholine receptor M4
Synonyms:
ACM4_RAT Chrm-4 | Chrm4
Type:
Enzyme Catalytic Domain
Mol. Mass.:
52841.70
Organism:
RAT
Description:
Cholinergic, muscarinic M4 CHRM4 RAT::P08485
Residue:
477
  
Inhibitor
Name:
BDBM48062
Synonyms:
3-amino-4-methyl-N-p-anisyl-6-propoxy-thieno[2,3-b]pyridine-2-carboxamide 3-amino-N-[(4-methoxyphenyl)methyl]-4-methyl-6-propoxythieno[2,3-b]pyridine-2-carboxamide VU0152122 | cid_45142474
Type:
Small organic molecule
Emp. Form.:
C20H23N3O3S
Mol. Mass.:
385.48
SMILES:
CCCOc1cc(C)c2c(N)c(sc2n1)C(=O)NCc1ccc(OC)cc1
: