Target
Muscarinic acetylcholine receptor M4
Ligand
BDBM48065
Substrate
Meas. Tech.
Discovery of a Highly Selective in vitro and in vivo M4 Positive Allosteric Modulator(PAM): Analog Potency
EC50
2210±n/a nM
Citation
 PubChem, PC Discovery of a Highly Selective in vitro and in vivo M4 Positive Allosteric Modulator(PAM): Analog Potency PubChem Bioassay (2010)[AID] 
Target
Name:
Muscarinic acetylcholine receptor M4
Synonyms:
ACM4_RAT Chrm-4 | Chrm4
Type:
Enzyme Catalytic Domain
Mol. Mass.:
52841.70
Organism:
RAT
Description:
Cholinergic, muscarinic M4 CHRM4 RAT::P08485
Residue:
477
  
Inhibitor
Name:
BDBM48065
Synonyms:
3-amino-4-methyl-N-p-anisyl-6-(3-pyridylmethoxy)thieno[2,3-b]pyridine-2-carboxamide 3-amino-N-[(4-methoxyphenyl)methyl]-4-methyl-6-(pyridin-3-ylmethoxy)thieno[2,3-b]pyridine-2-carboxamide VU0152130 | cid_44626303
Type:
Small organic molecule
Emp. Form.:
C23H22N4O3S
Mol. Mass.:
434.511
SMILES:
COc1ccc(CNC(=O)c2sc3nc(OCc4cccnc4)cc(C)c3c2N)cc1
: