Target
ATP-sensitive inward rectifier potassium channel 1
Ligand
BDBM265296
Substrate
Meas. Tech.
Thallium Flux Assay
IC50
92.0±n/a nM
Citation
 Biswas, DDing, FDong, SGu, XJiang, JPasternak, ASuzuki, TVacca, JXu, S Inhibitors of the renal outer medullary potassium channel US Patent  US9718808 Publication Date 8/1/2017 
Target
Name:
ATP-sensitive inward rectifier potassium channel 1
Synonyms:
ATP-regulated potassium channel ROM-K ATP-sensitive inward rectifier potassium channel 1 KCNJ1 Potassium channel (ATP modulatory) ROMK1 The Renal Outer Medullary Potassium (ROMK)
Type:
Enzyme Catalytic Domain
Mol. Mass.:
44809.08
Organism:
Homo sapiens (Human)
Description:
gi_223460826
Residue:
391
  
Inhibitor
Name:
BDBM265296
Synonyms:
US9718808, 15
Type:
Small organic molecule
Emp. Form.:
C9H6N4O
Mol. Mass.:
186.1701
SMILES:
O=Cc1ccc2Cn3nnnc3-c2c1
: