Target
ATP-sensitive inward rectifier potassium channel 1
Ligand
BDBM265500
Substrate
Meas. Tech.
Thallium Flux Assay
IC50
8.40±n/a nM
Citation
 Biswas, DDing, FDong, SGu, XJiang, JPasternak, ASuzuki, TVacca, JXu, S Inhibitors of the renal outer medullary potassium channel US Patent  US9718808 Publication Date 8/1/2017 
Target
Name:
ATP-sensitive inward rectifier potassium channel 1
Synonyms:
ATP-regulated potassium channel ROM-K ATP-sensitive inward rectifier potassium channel 1 KCNJ1 Potassium channel (ATP modulatory) ROMK1 The Renal Outer Medullary Potassium (ROMK)
Type:
Enzyme Catalytic Domain
Mol. Mass.:
44809.08
Organism:
Homo sapiens (Human)
Description:
gi_223460826
Residue:
391
  
Inhibitor
Name:
BDBM265500
Synonyms:
US9718808, 34
Type:
Small organic molecule
Emp. Form.:
C21H26N8O3
Mol. Mass.:
438.4829
SMILES:
CC1=C(COC1=O)N1CC[C@@]2(CC[C@@H](CC2)NCc2cc(C)c(nn2)-n2cnnn2)C1=O
: