Target
ATP-sensitive inward rectifier potassium channel 1
Ligand
BDBM265529
Substrate
Meas. Tech.
Thallium Flux Assay
IC50
19.0±n/a nM
Citation
 Biswas, DDing, FDong, SGu, XJiang, JPasternak, ASuzuki, TVacca, JXu, S Inhibitors of the renal outer medullary potassium channel US Patent  US9718808 Publication Date 8/1/2017 
Target
Name:
ATP-sensitive inward rectifier potassium channel 1
Synonyms:
ATP-regulated potassium channel ROM-K ATP-sensitive inward rectifier potassium channel 1 KCNJ1 Potassium channel (ATP modulatory) ROMK1 The Renal Outer Medullary Potassium (ROMK)
Type:
Enzyme Catalytic Domain
Mol. Mass.:
44809.08
Organism:
Homo sapiens (Human)
Description:
gi_223460826
Residue:
391
  
Inhibitor
Name:
BDBM265529
Synonyms:
US9718808, 45
Type:
Small organic molecule
Emp. Form.:
C24H28N6O3
Mol. Mass.:
448.5175
SMILES:
CC1=C(COC1=O)N1CCC2(CCC(CC2)NCc2ccc-3c(Cn4nnnc-34)c2C)C1=O
: