Target
ATP-sensitive inward rectifier potassium channel 1
Ligand
BDBM265571
Substrate
Meas. Tech.
Thallium Flux Assay
IC50
6.00±n/a nM
Citation
 Biswas, DDing, FDong, SGu, XJiang, JPasternak, ASuzuki, TVacca, JXu, S Inhibitors of the renal outer medullary potassium channel US Patent  US9718808 Publication Date 8/1/2017 
Target
Name:
ATP-sensitive inward rectifier potassium channel 1
Synonyms:
ATP-regulated potassium channel ROM-K ATP-sensitive inward rectifier potassium channel 1 KCNJ1 Potassium channel (ATP modulatory) ROMK1 The Renal Outer Medullary Potassium (ROMK)
Type:
Enzyme Catalytic Domain
Mol. Mass.:
44809.08
Organism:
Homo sapiens (Human)
Description:
gi_223460826
Residue:
391
  
Inhibitor
Name:
BDBM265571
Synonyms:
US9718808, 59
Type:
Small organic molecule
Emp. Form.:
C23H25FN6O3
Mol. Mass.:
452.4814
SMILES:
CC1=C(COC1=O)N1CC[C@@]2(CC[C@@H](CC2)NCc2ccc-3c(Cn4nnnc-34)c2F)C1=O
: