Target
ATP-sensitive inward rectifier potassium channel 1
Ligand
BDBM265618
Substrate
Meas. Tech.
Thallium Flux Assay
IC50
9.30±n/a nM
Citation
 Biswas, DDing, FDong, SGu, XJiang, JPasternak, ASuzuki, TVacca, JXu, S Inhibitors of the renal outer medullary potassium channel US Patent  US9718808 Publication Date 8/1/2017 
Target
Name:
ATP-sensitive inward rectifier potassium channel 1
Synonyms:
ATP-regulated potassium channel ROM-K ATP-sensitive inward rectifier potassium channel 1 KCNJ1 Potassium channel (ATP modulatory) ROMK1 The Renal Outer Medullary Potassium (ROMK)
Type:
Enzyme Catalytic Domain
Mol. Mass.:
44809.08
Organism:
Homo sapiens (Human)
Description:
gi_223460826
Residue:
391
  
Inhibitor
Name:
BDBM265618
Synonyms:
(5r,8r)-8-(((6-(2H-tetrazol-2-yl)pyridazin-3-yl)methyl)amino)-2-(4-methyl-5-oxo-2,5-dihydrofuran-3-yl)-2-azaspiro[4.5]decan-1-one | US9718808, 75
Type:
Small organic molecule
Emp. Form.:
C20H24N8O3
Mol. Mass.:
424.4564
SMILES:
CC1=C(COC1=O)N1CC[C@@]2(CC[C@@H](CC2)NCc2ccc(nn2)-n2ncnn2)C1=O
: