Target
ATP-sensitive inward rectifier potassium channel 1
Ligand
BDBM266969
Substrate
Meas. Tech.
Thallium Flux Assay
IC50
9.70±n/a nM
Citation
 Biswas, DDing, FDong, SGu, XJiang, JPasternak, ASuzuki, TVacca, JXu, S Inhibitors of the renal outer medullary potassium channel US Patent  US9718808 Publication Date 8/1/2017 
Target
Name:
ATP-sensitive inward rectifier potassium channel 1
Synonyms:
ATP-regulated potassium channel ROM-K ATP-sensitive inward rectifier potassium channel 1 KCNJ1 Potassium channel (ATP modulatory) ROMK1 The Renal Outer Medullary Potassium (ROMK)
Type:
Enzyme Catalytic Domain
Mol. Mass.:
44809.08
Organism:
Homo sapiens (Human)
Description:
gi_223460826
Residue:
391
  
Inhibitor
Name:
BDBM266969
Synonyms:
US9718808, 98
Type:
Small organic molecule
Emp. Form.:
C25H30N6O3
Mol. Mass.:
462.5441
SMILES:
CN(Cc1ccc-2c(Cn3nnnc-23)c1C)[C@H]1CC[C@@]2(CCN(C2=O)C2=C(C)C(=O)OC2)CC1
: