Target
Dual specificity protein phosphatase 3
Ligand
BDBM46133
Substrate
Meas. Tech.
SAR VHR1 Fluorescent Assay for In Vitro dose response studies
IC50
>100000±n/a nM
Citation
 PubChem, PC SAR VHR1 Fluorescent Assay for In Vitro dose response studies PubChem Bioassay (2009)[AID] 
Target
Name:
Dual specificity protein phosphatase 3
Synonyms:
DUS3_HUMAN Dual specificity protein phosphatase (VHR) Dual specificity protein phosphatase VHR Tyrosine-protein phosphatase non-receptor type 1 | VHR
Type:
Hydrolase
Mol. Mass.:
20480.58
Organism:
Homo sapiens (Human)
Description:
Residue:
185
  
Inhibitor
Name:
BDBM46133
Synonyms:
(7Z)-3-bromanyl-7-[(2-chlorophenyl)methylidene]-[1,3]thiazolo[4,5]imidazo[1,2-b]pyridin-8-one (7Z)-3-bromo-7-[(2-chlorophenyl)methylidene]-8-thiazolo[4,5]imidazo[1,2-b]pyridinone MLS-0091944.0001 | cid_2258411
Type:
Small organic molecule
Emp. Form.:
C15H7BrClN3OS
Mol. Mass.:
392.658
SMILES:
Clc1ccccc1\C=c1/sc2nc3cc(Br)cnc3n2c1=O
: