Target
Dual specificity protein phosphatase 3
Ligand
BDBM46205
Substrate
Meas. Tech.
SAR VHR1 Fluorescent Assay for In Vitro dose response studies
IC50
>99000±n/a nM
Citation
 PubChem, PC SAR VHR1 Fluorescent Assay for In Vitro dose response studies PubChem Bioassay (2009)[AID] 
Target
Name:
Dual specificity protein phosphatase 3
Synonyms:
DUS3_HUMAN Dual specificity protein phosphatase (VHR) Dual specificity protein phosphatase VHR Tyrosine-protein phosphatase non-receptor type 1 | VHR
Type:
Hydrolase
Mol. Mass.:
20480.58
Organism:
Homo sapiens (Human)
Description:
Residue:
185
  
Inhibitor
Name:
BDBM46205
Synonyms:
4-morpholinyl-[1-(2-phenoxyethyl)-3-indolyl]methanethione cid_986830 morpholino-[1-(2-phenoxyethyl)indol-3-yl]methanethione
Type:
Small organic molecule
Emp. Form.:
C21H22N2O2S
Mol. Mass.:
366.477
SMILES:
S=C(N1CCOCC1)c1cn(CCOc2ccccc2)c2ccccc12
: