Target
Dual specificity protein phosphatase 3
Ligand
BDBM46228
Substrate
Meas. Tech.
SAR VHR1 Fluorescent Assay for In Vitro dose response studies
IC50
14600±n/a nM
Citation
 PubChem, PC SAR VHR1 Fluorescent Assay for In Vitro dose response studies PubChem Bioassay (2009)[AID] 
Target
Name:
Dual specificity protein phosphatase 3
Synonyms:
DUS3_HUMAN Dual specificity protein phosphatase (VHR) Dual specificity protein phosphatase VHR Tyrosine-protein phosphatase non-receptor type 1 | VHR
Type:
Hydrolase
Mol. Mass.:
20480.58
Organism:
Homo sapiens (Human)
Description:
Residue:
185
  
Inhibitor
Name:
BDBM46228
Synonyms:
MLS-0261072.0001 | cid_2545473
Type:
Small organic molecule
Emp. Form.:
C25H16N2O5S2
Mol. Mass.:
488.535
SMILES:
OC(=O)CSc1cc(cn2c1nc1scc(-c3ccccc3)c1c2=O)C(=O)c1ccccc1O
: