Target
Dual specificity protein phosphatase 3
Ligand
BDBM46230
Substrate
Meas. Tech.
SAR VHR1 Fluorescent Assay for In Vitro dose response studies
IC50
>100000±n/a nM
Citation
 PubChem, PC SAR VHR1 Fluorescent Assay for In Vitro dose response studies PubChem Bioassay (2009)[AID] 
Target
Name:
Dual specificity protein phosphatase 3
Synonyms:
DUS3_HUMAN Dual specificity protein phosphatase (VHR) Dual specificity protein phosphatase VHR Tyrosine-protein phosphatase non-receptor type 1 | VHR
Type:
Hydrolase
Mol. Mass.:
20480.58
Organism:
Homo sapiens (Human)
Description:
Residue:
185
  
Inhibitor
Name:
BDBM46230
Synonyms:
4-chloranyl-N-(3,4-dihydro-2H-thiochromen-4-yl)-3-(dimethylsulfamoyl)benzamide 4-chloro-N-(3,4-dihydro-2H-1-benzothiopyran-4-yl)-3-(dimethylsulfamoyl)benzamide MLS-0412051.0001 | cid_16372661
Type:
Small organic molecule
Emp. Form.:
C18H19ClN2O3S2
Mol. Mass.:
410.938
SMILES:
CN(C)S(=O)(=O)c1cc(ccc1Cl)C(=O)NC1CCSc2ccccc12
: