Target
Dual specificity protein phosphatase 3
Ligand
BDBM46231
Substrate
Meas. Tech.
SAR VHR1 Fluorescent Assay for In Vitro dose response studies
IC50
>100000±n/a nM
Citation
 PubChem, PC SAR VHR1 Fluorescent Assay for In Vitro dose response studies PubChem Bioassay (2009)[AID] 
Target
Name:
Dual specificity protein phosphatase 3
Synonyms:
DUS3_HUMAN Dual specificity protein phosphatase (VHR) Dual specificity protein phosphatase VHR Tyrosine-protein phosphatase non-receptor type 1 | VHR
Type:
Hydrolase
Mol. Mass.:
20480.58
Organism:
Homo sapiens (Human)
Description:
Residue:
185
  
Inhibitor
Name:
BDBM46231
Synonyms:
3-sulfamoyl-N-thiochroman-4-yl-benzamide N-(3,4-dihydro-2H-1-benzothiopyran-4-yl)-3-sulfamoylbenzamide N-(3,4-dihydro-2H-thiochromen-4-yl)-3-sulfamoylbenzamide | cid_16326652
Type:
Small organic molecule
Emp. Form.:
C16H16N2O3S2
Mol. Mass.:
348.44
SMILES:
NS(=O)(=O)c1cccc(c1)C(=O)NC1CCSc2ccccc12
: