Target
Dual specificity protein phosphatase 3
Ligand
BDBM46211
Substrate
Meas. Tech.
SAR VHR1 absorbance Assay for In Vitro dose response studies.
IC50
704±n/a nM
Citation
 PubChem, PC SAR VHR1 absorbance Assay for In Vitro dose response studies. PubChem Bioassay (2009)[AID] 
Target
Name:
Dual specificity protein phosphatase 3
Synonyms:
DUS3_HUMAN Dual specificity protein phosphatase (VHR) Dual specificity protein phosphatase VHR Tyrosine-protein phosphatase non-receptor type 1 | VHR
Type:
Hydrolase
Mol. Mass.:
20480.58
Organism:
Homo sapiens (Human)
Description:
Residue:
185
  
Inhibitor
Name:
BDBM46211
Synonyms:
1-cyclohexyl-3-(4-sulfamoylphenyl)thiourea cid_892446
Type:
Small organic molecule
Emp. Form.:
C13H19N3O2S2
Mol. Mass.:
313.439
SMILES:
NS(=O)(=O)c1ccc(NC(=S)NC2CCCCC2)cc1
: