Target
Dual specificity protein phosphatase 3
Ligand
BDBM50
Substrate
Meas. Tech.
SAR VHR1 absorbance Assay for In Vitro dose response studies.
IC50
>100000±n/a nM
Citation
 PubChem, PC SAR VHR1 absorbance Assay for In Vitro dose response studies. PubChem Bioassay (2009)[AID] 
Target
Name:
Dual specificity protein phosphatase 3
Synonyms:
DUS3_HUMAN Dual specificity protein phosphatase (VHR) Dual specificity protein phosphatase VHR Tyrosine-protein phosphatase non-receptor type 1 | VHR
Type:
Hydrolase
Mol. Mass.:
20480.58
Organism:
Homo sapiens (Human)
Description:
Residue:
185
  
Inhibitor
Name:
BDBM50
Synonyms:
(2-Naphthyloxy)acetic acid 2-(2-naphthoxy)acetic acid 2-Naphthyloxyacetic acid 2-naphthalen-2-yloxyacetic acid Acetic acid, (2-naphthalenyloxy)- Betoxon Gerlach 1396 cid_8422
Type:
Small organic molecule
Emp. Form.:
C12H10O3
Mol. Mass.:
202.206
SMILES:
OC(=O)COc1ccc2ccccc2c1
: