Target
Beta-galactosidase
Ligand
BDBM48099
Substrate
Meas. Tech.
HTS Dose response counterscreen for assays utilizing the enzyme, b-galactosidase
EC50
14350±n/a nM
Citation
 PubChem, PC HTS Dose response counterscreen for assays utilizing the enzyme, b-galactosidase PubChem Bioassay (2009)[AID] 
Target
Name:
Beta-galactosidase
Synonyms:
BGAL_ECOLX Lactase | lacZ
Type:
PROTEIN
Mol. Mass.:
116943.87
Organism:
Escherichia coli
Description:
ChEMBL_215882
Residue:
1029
  
Inhibitor
Name:
BDBM48099
Synonyms:
2-[(5Z)-5-(3-ethoxy-4-hydroxy-benzylidene)-4-keto-2-thioxo-thiazolidin-3-yl]-2-phenyl-acetic acid 2-[(5Z)-5-[(3-ethoxy-4-hydroxyphenyl)methylidene]-4-oxo-2-sulfanylidene-3-thiazolidinyl]-2-phenylacetic acid MLS000806988 cid_5920999 | {5-[1-(3-Ethoxy-4-hydroxy-phenyl)-meth-(Z)-ylidene]-4-oxo-2-thioxo-thiazolidin-3-yl}-phenyl-acetic acid
Type:
Small organic molecule
Emp. Form.:
C20H17NO5S2
Mol. Mass.:
415.483
SMILES:
CCOc1cc(\C=C2/SC(=S)N(C(C(O)=O)c3ccccc3)C2=O)ccc1O
: