Target
Estrogen receptor beta
Ligand
BDBM48334
Substrate
Meas. Tech.
Estrogen Receptor-beta Coactivator Binding Inhibitors Dose Response Confirmation
IC50
1562.5±n/a nM
Citation
 PubChem, PC Estrogen Receptor-beta Coactivator Binding Inhibitors Dose Response Confirmation PubChem Bioassay (2007)[AID] 
Target
Name:
Estrogen receptor beta
Synonyms:
ER-beta ESR2_HUMAN Estradiol receptor beta (ERβ) Estrogen receptor (ER beta) Estrogen receptor beta (ER beta) NR3A2 estrogen beta
Type:
Protein
Mol. Mass.:
59238.43
Organism:
Homo sapiens (Human)
Description:
Q92731
Residue:
530
  
Inhibitor
Name:
BDBM48334
Synonyms:
3-(2-furanyl)-6-(thiophen-2-ylmethyl)-[1,2,4]triazolo[3,4-b][1,3,4]thiadiazole 3-(furan-2-yl)-6-(thiophen-2-ylmethyl)-[1,2,4]triazolo[3,4-b][1,3,4]thiadiazole SMR000044041 | cid_663295
Type:
Small organic molecule
Emp. Form.:
C12H8N4OS2
Mol. Mass.:
288.348
SMILES:
C(c1cccs1)c1nn2c(nnc2s1)-c1ccco1
: