Target
Estrogen receptor beta
Ligand
BDBM32273
Substrate
Meas. Tech.
Estrogen Receptor-beta Coactivator Binding Inhibitors Dose Response Confirmation
IC50
3905.74±n/a nM
Citation
 PubChem, PC Estrogen Receptor-beta Coactivator Binding Inhibitors Dose Response Confirmation PubChem Bioassay (2007)[AID] 
Target
Name:
Estrogen receptor beta
Synonyms:
ER-beta ESR2_HUMAN Estradiol receptor beta (ERβ) Estrogen receptor (ER beta) Estrogen receptor beta (ER beta) NR3A2 estrogen beta
Type:
Protein
Mol. Mass.:
59238.43
Organism:
Homo sapiens (Human)
Description:
Q92731
Residue:
530
  
Inhibitor
Name:
BDBM32273
Synonyms:
2,8-dimethyl-5,6-dihydrodipyrrolo[1,2-b:1',2'-e]pyrazine SMR000054319 cid_778626
Type:
Small organic molecule
Emp. Form.:
C12H14N2
Mol. Mass.:
186.253
SMILES:
Cc1cc2-c3ccc(C)n3CCn2c1
: