Target
Estrogen receptor beta
Ligand
BDBM40264
Substrate
Meas. Tech.
Estrogen Receptor-beta Coactivator Binding Inhibitors Dose Response Confirmation
IC50
2715.87±n/a nM
Citation
 PubChem, PC Estrogen Receptor-beta Coactivator Binding Inhibitors Dose Response Confirmation PubChem Bioassay (2007)[AID] 
Target
Name:
Estrogen receptor beta
Synonyms:
ER-beta ESR2_HUMAN Estradiol receptor beta (ERβ) Estrogen receptor (ER beta) Estrogen receptor beta (ER beta) NR3A2 estrogen beta
Type:
Protein
Mol. Mass.:
59238.43
Organism:
Homo sapiens (Human)
Description:
Q92731
Residue:
530
  
Inhibitor
Name:
BDBM40264
Synonyms:
4-[(3,5-dimethyl-4-isoxazolyl)methoxy]benzoic acid [2-(2,2-dimethyl-3-oxo-4H-quinoxalin-1-yl)-2-oxoethyl] ester MLS000567108 [2-(2,2-dimethyl-3-oxidanylidene-4H-quinoxalin-1-yl)-2-oxidanylidene-ethyl] 4-[(3,5-dimethyl-1,2-oxazol-4-yl)methoxy]benzoate cid_2477701
Type:
Small organic molecule
Emp. Form.:
C25H25N3O6
Mol. Mass.:
463.4825
SMILES:
Cc1noc(C)c1COc1ccc(cc1)C(=O)OCC(=O)N1c2ccccc2NC(=O)C1(C)C
: