Target
Eukaryotic translation initiation factor 4 gamma 1
Ligand
BDBM37536
Substrate
Meas. Tech.
Dose Response Confirmation for Small Molecule Inhibitors of Eukaryotic Translation Initiation
IC50
50000±n/a nM
Citation
 PubChem, PC Dose Response Confirmation for Small Molecule Inhibitors of Eukaryotic Translation Initiation PubChem Bioassay (2009)[AID] 
Target
Name:
Eukaryotic translation initiation factor 4 gamma 1
Synonyms:
EIF4F EIF4G1 IF4G1_HUMAN | eukaryotic translation initiation factor 4 gamma, 1 isoform 4
Type:
Enzyme Catalytic Domain
Mol. Mass.:
175455.17
Organism:
Homo sapiens (Human)
Description:
Q04637
Residue:
1599
  
Inhibitor
Name:
BDBM37536
Synonyms:
(2E,4S,4aR,5S,5aR,6S,12aS)-2-[amino(hydroxy)methylene]-4-(dimethylamino)-5,6,10,11,12a-pentahydroxy-6-methyl-4,4a,5,5a-tetrahydrotetracene-1,3,12-trione (2E,4S,4aR,5S,5aR,6S,12aS)-2-[azanyl(oxidanyl)methylidene]-4-(dimethylamino)-6-methyl-5,6,10,11,12a-pentakis(oxidanyl)-4,4a,5,5a-tetrahydrotetracene-1,3,12-trione Oxytetracycline cid_5282186
Type:
Small organic molecule
Emp. Form.:
C22H24N2O9
Mol. Mass.:
460.434
SMILES:
CN(C)[C@H]1[C@@H]2[C@@H](O)[C@H]3C(C(=O)c4c(O)cccc4[C@@]3(C)O)C(=O)[C@]2(O)C(=O)C(C(N)=O)C1=O
: