Target
Eukaryotic translation initiation factor 4 gamma 1
Ligand
BDBM37724
Substrate
Meas. Tech.
Dose Response Confirmation for Small Molecule Inhibitors of Eukaryotic Translation Initiation
IC50
64000±n/a nM
Citation
 PubChem, PC Dose Response Confirmation for Small Molecule Inhibitors of Eukaryotic Translation Initiation PubChem Bioassay (2009)[AID] 
Target
Name:
Eukaryotic translation initiation factor 4 gamma 1
Synonyms:
EIF4F EIF4G1 IF4G1_HUMAN | eukaryotic translation initiation factor 4 gamma, 1 isoform 4
Type:
Enzyme Catalytic Domain
Mol. Mass.:
175455.17
Organism:
Homo sapiens (Human)
Description:
Q04637
Residue:
1599
  
Inhibitor
Name:
BDBM37724
Synonyms:
(5Z)-5-{[4-(dimethylamino)phenyl]imino}-1,4-dimethyl-2,6-dioxo-1,2,5,6-tetrahydropyridine-3-carbonitrile 5-[4-(dimethylamino)phenyl]imino-1,4-dimethyl-2,6-dioxo-3-pyridinecarbonitrile 5-[4-(dimethylamino)phenyl]imino-2,6-diketo-1,4-dimethyl-nicotinonitrile SMR000024615 | cid_3241163
Type:
Small organic molecule
Emp. Form.:
C16H16N4O2
Mol. Mass.:
296.3238
SMILES:
CN(C)c1ccc(cc1)\N=C1/C(C)=C(C#N)C(=O)N(C)C1=O
: