Target
Eukaryotic translation initiation factor 4 gamma 1
Ligand
BDBM33066
Substrate
Meas. Tech.
Dose Response Confirmation for Small Molecule Inhibitors of Eukaryotic Translation Initiation
IC50
64000±n/a nM
Citation
 PubChem, PC Dose Response Confirmation for Small Molecule Inhibitors of Eukaryotic Translation Initiation PubChem Bioassay (2009)[AID] 
Target
Name:
Eukaryotic translation initiation factor 4 gamma 1
Synonyms:
EIF4F EIF4G1 IF4G1_HUMAN | eukaryotic translation initiation factor 4 gamma, 1 isoform 4
Type:
Enzyme Catalytic Domain
Mol. Mass.:
175455.17
Organism:
Homo sapiens (Human)
Description:
Q04637
Residue:
1599
  
Inhibitor
Name:
BDBM33066
Synonyms:
2,5-bis(chloranyl)-3-[2-(dimethylamino)-1,3-thiazol-5-yl]-6-pyrrolidin-1-yl-cyclohexa-2,5-diene-1,4-dione 2,5-dichloro-3-[2-(dimethylamino)-1,3-thiazol-5-yl]-6-pyrrolidin-1-ylcyclohexa-2,5-diene-1,4-dione 2,5-dichloro-3-[2-(dimethylamino)thiazol-5-yl]-6-pyrrolidino-p-benzoquinone SMR000115102 | cid_1002248
Type:
Small organic molecule
Emp. Form.:
C15H15Cl2N3O2S
Mol. Mass.:
372.27
SMILES:
CN(C)c1ncc(s1)C1=C(Cl)C(=O)C(N2CCCC2)=C(Cl)C1=O
: