Target
D(1B) dopamine receptor
Ligand
BDBM48904
Substrate
Meas. Tech.
Allosteric Modulators of D1 Receptors: Dose-dependent Counterscreen
EC50
0.00172±n/a nM
Citation
 PubChem, PC Allosteric Modulators of D1 Receptors: Dose-dependent Counterscreen PubChem Bioassay (2007)[AID] 
Target
Name:
D(1B) dopamine receptor
Synonyms:
D(5) dopamine receptor DOPAMINE D5 DRD1L2 DRD5_HUMAN | dopamine receptor D5
Type:
Protein
Mol. Mass.:
52943.41
Organism:
Homo sapiens (Human)
Description:
P21918
Residue:
477
  
Inhibitor
Name:
BDBM48904
Synonyms:
5-phenyl-[1,2,4]triazolo[4,3-c]quinazoline SMR000013286 | cid_645307
Type:
Small organic molecule
Emp. Form.:
C15H10N4
Mol. Mass.:
246.2667
SMILES:
c1nnc2c3ccccc3nc(-c3ccccc3)n12
: