Target
D(1B) dopamine receptor
Ligand
BDBM48932
Substrate
Meas. Tech.
Allosteric Modulators of D1 Receptors: Dose-dependent Counterscreen
EC50
0.0172±n/a nM
Citation
 PubChem, PC Allosteric Modulators of D1 Receptors: Dose-dependent Counterscreen PubChem Bioassay (2007)[AID] 
Target
Name:
D(1B) dopamine receptor
Synonyms:
D(5) dopamine receptor DOPAMINE D5 DRD1L2 DRD5_HUMAN | dopamine receptor D5
Type:
Protein
Mol. Mass.:
52943.41
Organism:
Homo sapiens (Human)
Description:
P21918
Residue:
477
  
Inhibitor
Name:
BDBM48932
Synonyms:
MLS000053281 N-(5-methyl-1,2-oxazol-3-yl)-2-(4-phenylphthalazin-1-yl)oxyacetamide N-(5-methylisoxazol-3-yl)-2-(4-phenylphthalazin-1-yl)oxy-acetamide cid_2997710
Type:
Small organic molecule
Emp. Form.:
C20H16N4O3
Mol. Mass.:
360.366
SMILES:
Cc1cc(NC(=O)COc2nnc(-c3ccccc3)c3ccccc23)no1
: