Target
D(1A) dopamine receptor
Ligand
BDBM48993
Substrate
Meas. Tech.
Allosteric Modulators of D1 Receptors: Dose-dependent Assay
EC50
0.0068±n/a nM
Citation
 PubChem, PC Allosteric Modulators of D1 Receptors: Dose-dependent Assay PubChem Bioassay (2007)[AID] 
Target
Name:
D(1A) dopamine receptor
Synonyms:
DA D1 receptor DRD1 Dopamine D1 receptor Dopamine D1A
Type:
Enzyme
Mol. Mass.:
49303.43
Organism:
Homo sapiens (Human)
Description:
P21728
Residue:
446
  
Inhibitor
Name:
BDBM48993
Synonyms:
2-[(4-benzofurazan-4-ylsulfonylpiperazino)methyl]-5,6-dimethyl-3H-thieno[2,3-d]pyrimidin-4-one 2-[[4-(2,1,3-benzoxadiazol-4-ylsulfonyl)-1-piperazinyl]methyl]-5,6-dimethyl-3H-thieno[2,3-d]pyrimidin-4-one MLS000068539 cid_652559
Type:
Small organic molecule
Emp. Form.:
C19H20N6O4S2
Mol. Mass.:
460.53
SMILES:
Cc1sc2nc(CN3CCN(CC3)S(=O)(=O)c3cccc4nonc34)[nH]c(=O)c2c1C
: