Target
D(1A) dopamine receptor
Ligand
BDBM48922
Substrate
Meas. Tech.
Allosteric Modulators of D1 Receptors: Dose-dependent Assay
EC50
0.00522±n/a nM
Citation
 PubChem, PC Allosteric Modulators of D1 Receptors: Dose-dependent Assay PubChem Bioassay (2007)[AID] 
Target
Name:
D(1A) dopamine receptor
Synonyms:
DA D1 receptor DRD1 Dopamine D1 receptor Dopamine D1A
Type:
Enzyme
Mol. Mass.:
49303.43
Organism:
Homo sapiens (Human)
Description:
P21728
Residue:
446
  
Inhibitor
Name:
BDBM48922
Synonyms:
3-[(6,6-dimethyl-2-methylsulfanyl-1,4,5,8-tetrahydropyrano[2,3]thieno[2,4-d]pyrimidin-4-yl)amino]propan-1-ol 3-[[6,6-dimethyl-2-(methylthio)-1,4,5,8-tetrahydropyrano[2,3]thieno[2,4-d]pyrimidin-4-yl]amino]propan-1-ol SMR000042781 | cid_662206
Type:
Small organic molecule
Emp. Form.:
C15H23N3O2S2
Mol. Mass.:
341.492
SMILES:
CSC1=Nc2sc3COC(C)(C)Cc3c2C(NCCCO)N1
: