Target
D(1A) dopamine receptor
Ligand
BDBM48966
Substrate
Meas. Tech.
Allosteric Modulators of D1 Receptors: Dose-dependent Assay
EC50
0.00201±n/a nM
Citation
 PubChem, PC Allosteric Modulators of D1 Receptors: Dose-dependent Assay PubChem Bioassay (2007)[AID] 
Target
Name:
D(1A) dopamine receptor
Synonyms:
DA D1 receptor DRD1 Dopamine D1 receptor Dopamine D1A
Type:
Enzyme
Mol. Mass.:
49303.43
Organism:
Homo sapiens (Human)
Description:
P21728
Residue:
446
  
Inhibitor
Name:
BDBM48966
Synonyms:
1-(3-amino-7-methoxy-1-pyrazolo[3,4-b]quinolinyl)-2-(2-methoxyphenyl)ethanone 1-(3-amino-7-methoxypyrazolo[3,4-b]quinolin-1-yl)-2-(2-methoxyphenyl)ethanone MLS000118160 cid_5307507
Type:
Small organic molecule
Emp. Form.:
C20H18N4O3
Mol. Mass.:
362.3819
SMILES:
COc1ccc2cc3c(N)nn(C(=O)Cc4ccccc4OC)c3nc2c1
: