Target
D(1A) dopamine receptor
Ligand
BDBM49096
Substrate
Meas. Tech.
Allosteric Modulators of D1 Receptors: Dose-dependent Assay
EC50
0.0026±n/a nM
Citation
 PubChem, PC Allosteric Modulators of D1 Receptors: Dose-dependent Assay PubChem Bioassay (2007)[AID] 
Target
Name:
D(1A) dopamine receptor
Synonyms:
DA D1 receptor DRD1 Dopamine D1 receptor Dopamine D1A
Type:
Enzyme
Mol. Mass.:
49303.43
Organism:
Homo sapiens (Human)
Description:
P21728
Residue:
446
  
Inhibitor
Name:
BDBM49096
Synonyms:
6-(cyclohexylamino)-8-(2-furanyl)-3,3-dimethyl-1,4-dihydropyrano[3,4-c]pyridine-5-carbonitrile 6-(cyclohexylamino)-8-(furan-2-yl)-3,3-dimethyl-1,4-dihydropyrano[3,4-c]pyridine-5-carbonitrile SMR000092716 | cid_1918453
Type:
Small organic molecule
Emp. Form.:
C21H25N3O2
Mol. Mass.:
351.4421
SMILES:
CC1(C)Cc2c(CO1)c(nc(NC1CCCCC1)c2C#N)-c1ccco1
: