Target
6-phosphofructo-2-kinase/fructose-2,6-bisphosphatase 4
Ligand
BDBM267022
Substrate
Meas. Tech.
PFKFB4 Assay
IC50
5400±n/a nM
Citation
 Martinsson, JFaernegardh, KJoensson, MRingom, R Bisarylsulfonamides useful in the treatment of inflammation and cancer US Patent  US9718809 Publication Date 8/1/2017 
Target
Name:
6-phosphofructo-2-kinase/fructose-2,6-bisphosphatase 4
Synonyms:
6-phosphofructo-2-kinase/fructose-2,6-bisphosphatase 4 (PFKFB4) PFKFB4
Type:
Enzyme
Mol. Mass.:
54039.68
Organism:
Homo sapiens (Human)
Description:
Q16877
Residue:
469
  
Inhibitor
Name:
BDBM267022
Synonyms:
Methyl 4-{[(3'-carbamoylbiphenyl-3-yl)sulfonyl]amino}-2-hydroxybenzoate | US9718809, 113
Type:
Small organic molecule
Emp. Form.:
C21H18N2O6S
Mol. Mass.:
426.442
SMILES:
COC(=O)c1ccc(NS(=O)(=O)c2cccc(c2)-c2cccc(c2)C(N)=O)cc1O
: