Target
6-phosphofructo-2-kinase/fructose-2,6-bisphosphatase 4
Ligand
BDBM267048
Substrate
Meas. Tech.
PFKFB4 Assay
IC50
3100±n/a nM
Citation
 Martinsson, JFaernegardh, KJoensson, MRingom, R Bisarylsulfonamides useful in the treatment of inflammation and cancer US Patent  US9718809 Publication Date 8/1/2017 
Target
Name:
6-phosphofructo-2-kinase/fructose-2,6-bisphosphatase 4
Synonyms:
6-phosphofructo-2-kinase/fructose-2,6-bisphosphatase 4 (PFKFB4) PFKFB4
Type:
Enzyme
Mol. Mass.:
54039.68
Organism:
Homo sapiens (Human)
Description:
Q16877
Residue:
469
  
Inhibitor
Name:
BDBM267048
Synonyms:
General Procedure 5 | US9718809, 53
Type:
Small organic molecule
Emp. Form.:
C13H11Cl2NO5S2
Mol. Mass.:
396.266
SMILES:
COC(=O)c1ccc(NS(=O)(=O)c2c(Cl)sc(Cl)c2C)cc1O
: