Target
6-phosphofructo-2-kinase/fructose-2,6-bisphosphatase 4
Ligand
BDBM267060
Substrate
Meas. Tech.
PFKFB4 Assay
IC50
5200±n/a nM
Citation
 Martinsson, JFaernegardh, KJoensson, MRingom, R Bisarylsulfonamides useful in the treatment of inflammation and cancer US Patent  US9718809 Publication Date 8/1/2017 
Target
Name:
6-phosphofructo-2-kinase/fructose-2,6-bisphosphatase 4
Synonyms:
6-phosphofructo-2-kinase/fructose-2,6-bisphosphatase 4 (PFKFB4) PFKFB4
Type:
Enzyme
Mol. Mass.:
54039.68
Organism:
Homo sapiens (Human)
Description:
Q16877
Residue:
469
  
Inhibitor
Name:
BDBM267060
Synonyms:
Tetrahydrofuran-3-yl 4-{[(2,5-dichloro-3-thienyl)sulfonyl]amino}-2-hydroxybenzoate | US9718809, 67
Type:
Small organic molecule
Emp. Form.:
C15H13Cl2NO6S2
Mol. Mass.:
438.303
SMILES:
Oc1cc(NS(=O)(=O)c2cc(Cl)sc2Cl)ccc1C(=O)OC1CCOC1
: