Target
6-phosphofructo-2-kinase/fructose-2,6-bisphosphatase 4
Ligand
BDBM267062
Substrate
Meas. Tech.
PFKFB4 Assay
IC50
200±n/a nM
Citation
 Martinsson, JFaernegardh, KJoensson, MRingom, R Bisarylsulfonamides useful in the treatment of inflammation and cancer US Patent  US9718809 Publication Date 8/1/2017 
Target
Name:
6-phosphofructo-2-kinase/fructose-2,6-bisphosphatase 4
Synonyms:
6-phosphofructo-2-kinase/fructose-2,6-bisphosphatase 4 (PFKFB4) PFKFB4
Type:
Enzyme
Mol. Mass.:
54039.68
Organism:
Homo sapiens (Human)
Description:
Q16877
Residue:
469
  
Inhibitor
Name:
BDBM267062
Synonyms:
Butyl 4-{[(4,5-dichloro-2-thienyl)sulfonyl]amino}-2-hydroxybenzoate | US9718809, 70
Type:
Small organic molecule
Emp. Form.:
C15H15Cl2NO5S2
Mol. Mass.:
424.319
SMILES:
CCCCOC(=O)c1ccc(NS(=O)(=O)c2cc(Cl)c(Cl)s2)cc1O
: