Target
6-phosphofructo-2-kinase/fructose-2,6-bisphosphatase 4
Ligand
BDBM267075
Substrate
Meas. Tech.
PFKFB4 Assay
IC50
4500±n/a nM
Citation
 Martinsson, JFaernegardh, KJoensson, MRingom, R Bisarylsulfonamides useful in the treatment of inflammation and cancer US Patent  US9718809 Publication Date 8/1/2017 
Target
Name:
6-phosphofructo-2-kinase/fructose-2,6-bisphosphatase 4
Synonyms:
6-phosphofructo-2-kinase/fructose-2,6-bisphosphatase 4 (PFKFB4) PFKFB4
Type:
Enzyme
Mol. Mass.:
54039.68
Organism:
Homo sapiens (Human)
Description:
Q16877
Residue:
469
  
Inhibitor
Name:
BDBM267075
Synonyms:
Methyl 2-hydroxy-4-{[(3-quinolin-6-ylphenyl)sulfonyl]amino}benzoate trifluoroacetate | US9718809, 91
Type:
Small organic molecule
Emp. Form.:
C25H19F3N2O7S
Mol. Mass.:
548.488
SMILES:
OC(=O)C(F)(F)F.COC(=O)c1ccc(NS(=O)(=O)c2cccc(c2)-c2ccc3ncccc3c2)cc1O
: