Target
6-phosphofructo-2-kinase/fructose-2,6-bisphosphatase 4
Ligand
BDBM267081
Substrate
Meas. Tech.
PFKFB4 Assay
IC50
8400±n/a nM
Citation
 Martinsson, JFaernegardh, KJoensson, MRingom, R Bisarylsulfonamides useful in the treatment of inflammation and cancer US Patent  US9718809 Publication Date 8/1/2017 
Target
Name:
6-phosphofructo-2-kinase/fructose-2,6-bisphosphatase 4
Synonyms:
6-phosphofructo-2-kinase/fructose-2,6-bisphosphatase 4 (PFKFB4) PFKFB4
Type:
Enzyme
Mol. Mass.:
54039.68
Organism:
Homo sapiens (Human)
Description:
Q16877
Residue:
469
  
Inhibitor
Name:
BDBM267081
Synonyms:
Methyl 4-({[4'-(dimethylcarbamoyl)biphenyl-3-yl]sulfonyl}amino)-2-hydroxybenzoate | US9718809, 101
Type:
Small organic molecule
Emp. Form.:
C23H22N2O6S
Mol. Mass.:
454.496
SMILES:
COC(=O)c1ccc(NS(=O)(=O)c2cccc(c2)-c2ccc(cc2)C(=O)N(C)C)cc1O
: