Target
Estrogen receptor beta
Ligand
BDBM35377
Substrate
Meas. Tech.
Estrogen Receptor-beta Coactivator Binding Inhibitors ELISA Secondary Assay
IC50
23±n/a nM
Citation
 PubChem, PC Estrogen Receptor-beta Coactivator Binding Inhibitors ELISA Secondary Assay PubChem Bioassay (2008)[AID] 
Target
Name:
Estrogen receptor beta
Synonyms:
ER-beta ESR2_HUMAN Estradiol receptor beta (ERβ) Estrogen receptor (ER beta) Estrogen receptor beta (ER beta) NR3A2 estrogen beta
Type:
Protein
Mol. Mass.:
59238.43
Organism:
Homo sapiens (Human)
Description:
Q92731
Residue:
530
  
Inhibitor
Name:
BDBM35377
Synonyms:
MLS000081820 N-[4-(4-methylphenyl)-2-thiazolyl]-5-isoxazolecarboxamide SMR000063580 | cid_2999703
Type:
Small organic molecule
Emp. Form.:
C14H11N3O2S
Mol. Mass.:
285.321
SMILES:
Cc1ccc(cc1)-c1csc(NC(=O)c2ccno2)n1
: