Target
Estrogen receptor beta
Ligand
BDBM49149
Substrate
Meas. Tech.
Estrogen Receptor-beta Coactivator Binding Inhibitors ELISA Secondary Assay
IC50
23±n/a nM
Citation
 PubChem, PC Estrogen Receptor-beta Coactivator Binding Inhibitors ELISA Secondary Assay PubChem Bioassay (2008)[AID] 
Target
Name:
Estrogen receptor beta
Synonyms:
ER-beta ESR2_HUMAN Estradiol receptor beta (ERβ) Estrogen receptor (ER beta) Estrogen receptor beta (ER beta) NR3A2 estrogen beta
Type:
Protein
Mol. Mass.:
59238.43
Organism:
Homo sapiens (Human)
Description:
Q92731
Residue:
530
  
Inhibitor
Name:
BDBM49149
Synonyms:
4-(2-hydroxyethyl)-7-methyl-8a-oxidanyl-2,3-dihydro-1,4-benzoxazin-6-one 8a-hydroxy-4-(2-hydroxyethyl)-7-methyl-2,3-dihydro-1,4-benzoxazin-6-one SMR000116758 | cid_2865279
Type:
Small organic molecule
Emp. Form.:
C11H15NO4
Mol. Mass.:
225.2411
SMILES:
CC1=CC2(O)OCCN(CCO)C2=CC1=O
: